Target
Envelope glycoprotein gp160
Ligand
BDBM95274
Substrate
IC50
61324±n/a nM
Citation
 PubChem, PC TRFRET-based biochemical high throughput dose response assay for small molecules that bind to the HIV-1-gp120 binding antibody, PG9 PubChem Bioassay (2012)[AID] 
Target
Name:
Envelope glycoprotein gp160
Synonyms:
ENV_HV1H2 Envelope surface glycoprotein gp160, precursor env
Type:
Mol. Mass.:
97241.93
Organism:
Human immunodeficiency virus type 1 group M subtype B (isolate HXB2)
Description:
Residue:
856
  
Inhibitor
Name:
BDBM95274
Synonyms:
3-[3-(4-methyl-1-piperidinyl)propyl]-2-sulfanylidene-1H-[1]benzothiolo[3,2-d]pyrimidin-4-one;hydrochloride 3-[3-(4-methylpiperidin-1-yl)propyl]-2-thioxo-2,3-dihydro[1]benzothieno[3,2-d]pyrimidin-4(1H)-one MLS000660977 cid_16195574
Type:
Small organic molecule
Emp. Form.:
C19H23N3OS2
Mol. Mass.:
373.535
SMILES:
CC1CCN(CCCn2c(=S)[nH]c3c4ccccc4sc3c2=O)CC1
: