Target
Envelope glycoprotein gp160
Ligand
BDBM95276
Substrate
IC50
>67054±n/a nM
Citation
 PubChem, PC TRFRET-based biochemical high throughput dose response assay for small molecules that bind to the HIV-1-gp120 binding antibody, PG9 PubChem Bioassay (2012)[AID] 
Target
Name:
Envelope glycoprotein gp160
Synonyms:
ENV_HV1H2 Envelope surface glycoprotein gp160, precursor env
Type:
Mol. Mass.:
97241.93
Organism:
Human immunodeficiency virus type 1 group M subtype B (isolate HXB2)
Description:
Residue:
856
  
Inhibitor
Name:
BDBM95276
Synonyms:
6-[1-oxo-2-[4-(1-oxopropyl)phenoxy]ethyl]-4H-1,4-benzoxazin-3-one 6-[2-(4-propanoylphenoxy)ethanoyl]-4H-1,4-benzoxazin-3-one MLS000771362 cid_2515869
Type:
Small organic molecule
Emp. Form.:
C19H17NO5
Mol. Mass.:
339.342
SMILES:
CCC(=O)c1ccc(OCC(=O)c2ccc3OCC(=O)Nc3c2)cc1
: