Target
Envelope glycoprotein gp160
Ligand
BDBM95290
Substrate
IC50
>67045±n/a nM
Citation
 PubChem, PC TRFRET-based biochemical high throughput dose response assay for small molecules that bind to the HIV-1-gp120 binding antibody, PG9 PubChem Bioassay (2012)[AID] 
Target
Name:
Envelope glycoprotein gp160
Synonyms:
ENV_HV1H2 Envelope surface glycoprotein gp160, precursor env
Type:
Mol. Mass.:
97241.93
Organism:
Human immunodeficiency virus type 1 group M subtype B (isolate HXB2)
Description:
Residue:
856
  
Inhibitor
Name:
BDBM95290
Synonyms:
4-(methylthio)-N-thiochroman-4-yl-benzamide N-(3,4-dihydro-2H-1-benzothiopyran-4-yl)-4-(methylthio)benzamide N-(3,4-dihydro-2H-thiochromen-4-yl)-4-methylsulfanylbenzamide cid_16305810
Type:
Small organic molecule
Emp. Form.:
C17H17NOS2
Mol. Mass.:
315.453
SMILES:
CSc1ccc(cc1)C(=O)NC1CCSc2ccccc12
: