Target
Envelope glycoprotein gp160
Ligand
BDBM66937
Substrate
IC50
>67034±n/a nM
Citation
 PubChem, PC TRFRET-based biochemical high throughput dose response assay for small molecules that bind to the HIV-1-gp120 binding antibody, PG9 PubChem Bioassay (2012)[AID] 
Target
Name:
Envelope glycoprotein gp160
Synonyms:
ENV_HV1H2 Envelope surface glycoprotein gp160, precursor env
Type:
Mol. Mass.:
97241.93
Organism:
Human immunodeficiency virus type 1 group M subtype B (isolate HXB2)
Description:
Residue:
856
  
Inhibitor
Name:
BDBM66937
Synonyms:
MLS001140217 cid_4890916
Type:
Small organic molecule
Emp. Form.:
C21H17ClN4O3
Mol. Mass.:
408.838
SMILES:
Clc1cccc(NC(=O)Cn2cnc3c4cc5CCCCc5nc4oc3c2=O)c1
: