Target
Envelope glycoprotein gp160
Ligand
BDBM95251
Substrate
IC50
39395±n/a nM
Citation
 PubChem, PC Counterscreen for discovery of small molecules that bind to the HIV-1-gp120 binding antibody, PG9 PubChem Bioassay (2012)[AID] 
Target
Name:
Envelope glycoprotein gp160
Synonyms:
ENV_HV1H2 Envelope surface glycoprotein gp160, precursor env
Type:
Mol. Mass.:
97241.93
Organism:
Human immunodeficiency virus type 1 group M subtype B (isolate HXB2)
Description:
Residue:
856
  
Inhibitor
Name:
BDBM95251
Synonyms:
2-(2-Cyclopropyl-5,6-dimethyl-thieno[2,3-d]pyrimidin-4-ylsulfanyl)-N-(5-methyl-isoxazol-3-yl)-acetamide 2-(2-cyclopropyl-5,6-dimethylthieno[2,3-d]pyrimidin-4-yl)sulfanyl-N-(5-methyl-1,2-oxazol-3-yl)acetamide 2-[(2-cyclopropyl-5,6-dimethyl-thieno[2,3-d]pyrimidin-4-yl)thio]-N-(5-methylisoxazol-3-yl)acetamide SMR000116961 | cid_1466867
Type:
Small organic molecule
Emp. Form.:
C17H18N4O2S2
Mol. Mass.:
374.48
SMILES:
Cc1cc(NC(=O)CSc2nc(nc3sc(C)c(C)c23)C2CC2)no1
: