Target
Envelope glycoprotein gp160
Ligand
BDBM95262
Substrate
IC50
6410±n/a nM
Citation
 PubChem, PC Counterscreen for discovery of small molecules that bind to the HIV-1-gp120 binding antibody, PG9 PubChem Bioassay (2012)[AID] 
Target
Name:
Envelope glycoprotein gp160
Synonyms:
ENV_HV1H2 Envelope surface glycoprotein gp160, precursor env
Type:
Mol. Mass.:
97241.93
Organism:
Human immunodeficiency virus type 1 group M subtype B (isolate HXB2)
Description:
Residue:
856
  
Inhibitor
Name:
BDBM95262
Synonyms:
10-(4-chlorophenyl)-8,9-dihydro-3H-cyclopenta[5',6']pyrido[3',2':4,5]thieno[3,2-d]pyrimidin-4(7H)-one SMR000162521 | cid_990652
Type:
Small organic molecule
Emp. Form.:
C18H12ClN3OS
Mol. Mass.:
353.825
SMILES:
Clc1ccc(cc1)-c1c2CCCc2nc2sc3c([nH]cnc3=O)c12
: