Target
Envelope glycoprotein gp160
Ligand
BDBM95273
Substrate
IC50
20622±n/a nM
Citation
 PubChem, PC Counterscreen for discovery of small molecules that bind to the HIV-1-gp120 binding antibody, PG9 PubChem Bioassay (2012)[AID] 
Target
Name:
Envelope glycoprotein gp160
Synonyms:
ENV_HV1H2 Envelope surface glycoprotein gp160, precursor env
Type:
Mol. Mass.:
97241.93
Organism:
Human immunodeficiency virus type 1 group M subtype B (isolate HXB2)
Description:
Residue:
856
  
Inhibitor
Name:
BDBM95273
Synonyms:
6-(6-bromanyl-4-oxidanylidene-2-sulfanylidene-1H-quinazolin-3-yl)-N-[2-(4-sulfamoylphenyl)ethyl]hexanamide 6-(6-bromo-4-oxo-2-sulfanylidene-1H-quinazolin-3-yl)-N-[2-(4-sulfamoylphenyl)ethyl]hexanamide N-{2-[4-(aminosulfonyl)phenyl]ethyl}-6-(6-bromo-4-oxo-2-thioxo-1,4-dihydroquinazolin-3(2H)-yl)hexanamide cid_4601866
Type:
Small organic molecule
Emp. Form.:
C22H25BrN4O4S2
Mol. Mass.:
553.492
SMILES:
NS(=O)(=O)c1ccc(CCNC(=O)CCCCCn2c(=S)[nH]c3ccc(Br)cc3c2=O)cc1
: