Target
Envelope glycoprotein gp160
Ligand
BDBM95285
Substrate
IC50
>67121±n/a nM
Citation
 PubChem, PC Counterscreen for discovery of small molecules that bind to the HIV-1-gp120 binding antibody, PG9 PubChem Bioassay (2012)[AID] 
Target
Name:
Envelope glycoprotein gp160
Synonyms:
ENV_HV1H2 Envelope surface glycoprotein gp160, precursor env
Type:
Mol. Mass.:
97241.93
Organism:
Human immunodeficiency virus type 1 group M subtype B (isolate HXB2)
Description:
Residue:
856
  
Inhibitor
Name:
BDBM95285
Synonyms:
5-ethyl-5-methyl-2-(methylthio)-1,6-dihydrobenzo[h]quinazolin-4-one MLS001213473 cid_3796895
Type:
Small organic molecule
Emp. Form.:
C16H18N2OS
Mol. Mass.:
286.392
SMILES:
CCC1(C)Cc2ccccc2-c2nc(SC)[nH]c(=O)c12
: