Target
Envelope glycoprotein gp160
Ligand
BDBM95304
Substrate
IC50
11530±n/a nM
Citation
 PubChem, PC Counterscreen for discovery of small molecules that bind to the HIV-1-gp120 binding antibody, PG9 PubChem Bioassay (2012)[AID] 
Target
Name:
Envelope glycoprotein gp160
Synonyms:
ENV_HV1H2 Envelope surface glycoprotein gp160, precursor env
Type:
Mol. Mass.:
97241.93
Organism:
Human immunodeficiency virus type 1 group M subtype B (isolate HXB2)
Description:
Residue:
856
  
Inhibitor
Name:
BDBM95304
Synonyms:
2-[2-(6-bromanylquinazolin-4-yl)oxyethanoyl-methyl-amino]-N-(4-methylphenyl)ethanamide 2-[[2-(6-bromoquinazolin-4-yl)oxyacetyl]-methylamino]-N-(4-methylphenyl)acetamide MLS002169748 cid_16282512
Type:
Small organic molecule
Emp. Form.:
C20H19BrN4O3
Mol. Mass.:
443.294
SMILES:
CN(CC(=O)Nc1ccc(C)cc1)C(=O)COc1ncnc2ccc(Br)cc12
: