Target
Envelope glycoprotein gp160
Ligand
BDBM95305
Substrate
IC50
47710±n/a nM
Citation
 PubChem, PC Counterscreen for discovery of small molecules that bind to the HIV-1-gp120 binding antibody, PG9 PubChem Bioassay (2012)[AID] 
Target
Name:
Envelope glycoprotein gp160
Synonyms:
ENV_HV1H2 Envelope surface glycoprotein gp160, precursor env
Type:
Mol. Mass.:
97241.93
Organism:
Human immunodeficiency virus type 1 group M subtype B (isolate HXB2)
Description:
Residue:
856
  
Inhibitor
Name:
BDBM95305
Synonyms:
1,3-benzodioxole-5-carboxylic acid [2-(2,4-dimethoxyanilino)-2-oxoethyl] ester SMR001310057 [2-[(2,4-dimethoxyphenyl)amino]-2-oxidanylidene-ethyl] 1,3-benzodioxole-5-carboxylate piperonylic acid [2-(2,4-dimethoxyanilino)-2-keto-ethyl] ester
Type:
Small organic molecule
Emp. Form.:
C18H17NO7
Mol. Mass.:
359.3301
SMILES:
COc1ccc(NC(=O)COC(=O)c2ccc3OCOc3c2)c(OC)c1
: