Target
Envelope glycoprotein gp160
Ligand
BDBM95310
Substrate
IC50
>67046±n/a nM
Citation
 PubChem, PC Counterscreen for discovery of small molecules that bind to the HIV-1-gp120 binding antibody, PG9 PubChem Bioassay (2012)[AID] 
Target
Name:
Envelope glycoprotein gp160
Synonyms:
ENV_HV1H2 Envelope surface glycoprotein gp160, precursor env
Type:
Mol. Mass.:
97241.93
Organism:
Human immunodeficiency virus type 1 group M subtype B (isolate HXB2)
Description:
Residue:
856
  
Inhibitor
Name:
BDBM95310
Synonyms:
2-[(4-methoxyphenyl)methylamino]-6-methyl-4-[3-(trifluoromethyl)phenyl]-1-[[2-(trifluoromethyl)phenyl]methyl]-4H-pyrimidine-5-carboxylic acid methyl ester MLS003843370 cid_53316186 | methyl 2-[(4-methoxyphenyl)methylamino]-6-methyl-4-[3-(trifluoromethyl)phenyl]-1-[[2-(trifluoromethyl)phenyl]methyl]-4H-pyrimidine-5-carboxylate
Type:
Small organic molecule
Emp. Form.:
C30H27F6N3O3
Mol. Mass.:
591.5441
SMILES:
COC(=O)C1=C(C)N(Cc2ccccc2C(F)(F)F)C(NCc2ccc(OC)cc2)=NC1c1cccc(c1)C(F)(F)F
: