Target
Envelope glycoprotein gp160
Ligand
BDBM41012
Substrate
IC50
14722±n/a nM
Citation
 PubChem, PC Counterscreen for discovery of small molecules that bind to the HIV-1-gp120 binding antibody, PG9 PubChem Bioassay (2012)[AID] 
Target
Name:
Envelope glycoprotein gp160
Synonyms:
ENV_HV1H2 Envelope surface glycoprotein gp160, precursor env
Type:
Mol. Mass.:
97241.93
Organism:
Human immunodeficiency virus type 1 group M subtype B (isolate HXB2)
Description:
Residue:
856
  
Inhibitor
Name:
BDBM41012
Synonyms:
1-[4-(2-phenyl-4-pyrimidinyl)phenyl]-1H-1,3-benzimidazole 1-[4-(2-phenylpyrimidin-4-yl)phenyl]benzimidazole SMR000126182 | cid_1477791
Type:
Small organic molecule
Emp. Form.:
C23H16N4
Mol. Mass.:
348.3999
SMILES:
c1nc2ccccc2n1-c1ccc(cc1)-c1ccnc(n1)-c1ccccc1
: