Target
Envelope glycoprotein gp160
Ligand
BDBM95263
Substrate
IC50
16546±n/a nM
Citation
 PubChem, PC Counterscreen for discovery of small molecules that bind to the HIV-1-gp120 binding antibody, PG9 PubChem Bioassay (2012)[AID] 
Target
Name:
Envelope glycoprotein gp160
Synonyms:
ENV_HV1H2 Envelope surface glycoprotein gp160, precursor env
Type:
Mol. Mass.:
97241.93
Organism:
Human immunodeficiency virus type 1 group M subtype B (isolate HXB2)
Description:
Residue:
856
  
Inhibitor
Name:
BDBM95263
Synonyms:
2-(5,6-Dimethyl-2-propyl-thieno[2,3-d]pyrimidin-4-ylsulfanyl)-N-(5-ethyl-[1,3,4]thiadiazol-2-yl)-acetamide 2-(5,6-dimethyl-2-propylthieno[2,3-d]pyrimidin-4-yl)sulfanyl-N-(5-ethyl-1,3,4-thiadiazol-2-yl)acetamide 2-[(5,6-dimethyl-2-propyl-thieno[2,3-d]pyrimidin-4-yl)thio]-N-(5-ethyl-1,3,4-thiadiazol-2-yl)acetamide SMR000173037 | cid_3197528
Type:
Small organic molecule
Emp. Form.:
C17H21N5OS3
Mol. Mass.:
407.577
SMILES:
CCCc1nc(SCC(=O)Nc2nnc(CC)s2)c2c(C)c(C)sc2n1
: