Target
Envelope glycoprotein gp160
Ligand
BDBM66170
Substrate
IC50
56290±n/a nM
Citation
 PubChem, PC Counterscreen for discovery of small molecules that bind to the HIV-1-gp120 binding antibody, PG9 PubChem Bioassay (2012)[AID] 
Target
Name:
Envelope glycoprotein gp160
Synonyms:
ENV_HV1H2 Envelope surface glycoprotein gp160, precursor env
Type:
Mol. Mass.:
97241.93
Organism:
Human immunodeficiency virus type 1 group M subtype B (isolate HXB2)
Description:
Residue:
856
  
Inhibitor
Name:
BDBM66170
Synonyms:
3-(4-methoxyphenyl)-2-sulfanylidene-1H-[1]benzofuro[3,2-d]pyrimidin-4-one 3-(4-methoxyphenyl)-2-thioxo-1H-benzofuro[3,2-d]pyrimidin-4-one SMR000236839 | cid_7120051
Type:
Small organic molecule
Emp. Form.:
C17H12N2O3S
Mol. Mass.:
324.354
SMILES:
COc1ccc(cc1)-n1c(=S)[nH]c2c3ccccc3oc2c1=O
: