Target
Envelope glycoprotein gp160
Ligand
BDBM95269
Substrate
IC50
3746±n/a nM
Citation
 PubChem, PC Counterscreen for discovery of small molecules that bind to the HIV-1-gp120 binding antibody, PG9 PubChem Bioassay (2012)[AID] 
Target
Name:
Envelope glycoprotein gp160
Synonyms:
ENV_HV1H2 Envelope surface glycoprotein gp160, precursor env
Type:
Mol. Mass.:
97241.93
Organism:
Human immunodeficiency virus type 1 group M subtype B (isolate HXB2)
Description:
Residue:
856
  
Inhibitor
Name:
BDBM95269
Synonyms:
(3-besyltriazolo[1,5-a]quinazolin-5-yl)-(2,3-dimethylphenyl)amine 3-(benzenesulfonyl)-N-(2,3-dimethylphenyl)triazolo[1,5-a]quinazolin-5-amine N-(2,3-dimethylphenyl)-3-(phenylsulfonyl)-[1,2,3]triazolo[1,5-a]quinazolin-5-amine cid_2137373
Type:
Small organic molecule
Emp. Form.:
C23H19N5O2S
Mol. Mass.:
429.494
SMILES:
Cc1cccc(Nc2nc3c(nnn3c3ccccc23)S(=O)(=O)c2ccccc2)c1C
: