Target
Envelope glycoprotein gp160
Ligand
BDBM95286
Substrate
IC50
>67037±n/a nM
Citation
 PubChem, PC Counterscreen for discovery of small molecules that bind to the HIV-1-gp120 binding antibody, PG9 PubChem Bioassay (2012)[AID] 
Target
Name:
Envelope glycoprotein gp160
Synonyms:
ENV_HV1H2 Envelope surface glycoprotein gp160, precursor env
Type:
Mol. Mass.:
97241.93
Organism:
Human immunodeficiency virus type 1 group M subtype B (isolate HXB2)
Description:
Residue:
856
  
Inhibitor
Name:
BDBM95286
Synonyms:
2-azanylidene-7-ethoxy-N-(phenylmethyl)chromene-3-carboxamide MLS001194879 N-benzyl-7-ethoxy-2-imino-chromene-3-carboxamide SMR000554765 | cid_4033284
Type:
Small organic molecule
Emp. Form.:
C19H18N2O3
Mol. Mass.:
322.3578
SMILES:
CCOc1ccc2cc(C(=O)NCc3ccccc3)c(=N)oc2c1
: