Target
Envelope glycoprotein gp160
Ligand
BDBM95294
Substrate
IC50
34839±n/a nM
Citation
 PubChem, PC Counterscreen for discovery of small molecules that bind to the HIV-1-gp120 binding antibody, PG9 PubChem Bioassay (2012)[AID] 
Target
Name:
Envelope glycoprotein gp160
Synonyms:
ENV_HV1H2 Envelope surface glycoprotein gp160, precursor env
Type:
Mol. Mass.:
97241.93
Organism:
Human immunodeficiency virus type 1 group M subtype B (isolate HXB2)
Description:
Residue:
856
  
Inhibitor
Name:
BDBM95294
Synonyms:
MLS001029332 N-[(2-chlorophenyl)methyl]-4-(8-oxidanylidene-6-sulfanylidene-5H-[1,3]dioxolo[4,5-g]quinazolin-7-yl)butanamide SMR000634337 | cid_5069161
Type:
Small organic molecule
Emp. Form.:
C20H18ClN3O4S
Mol. Mass.:
431.893
SMILES:
Clc1ccccc1CNC(=O)CCCn1c(=S)[nH]c2cc3OCOc3cc2c1=O
: