Target
Nuclear receptor subfamily 5 group A member 2
Ligand
BDBM95508
Substrate
IC50
>3989±n/a nM
Citation
 PubChem, PC Luminescence-based cell-based high throughput dose response assay for inverse agonists of the liver receptor homolog-1 (LRH-1; NR5A2) PubChem Bioassay (2013)[AID] 
Target
Name:
Nuclear receptor subfamily 5 group A member 2
Synonyms:
Alpha-1-fetoprotein transcription factor B1F CYP7A promoter-binding factor Hepatocytic transcription factor Liver Receptor Homolog 1 NR5A2_HUMAN hB1F | nuclear receptor subfamily 5 group A member 2 isoform 2
Type:
Nuclear Hormone Receptor
Mol. Mass.:
61341.37
Organism:
Homo sapiens (Human)
Description:
Residue:
541
  
Inhibitor
Name:
BDBM95508
Synonyms:
1-(2-fluoranyl-4-nitro-5-piperazin-1-yl-phenyl)azepane 1-(2-fluoro-4-nitro-5-piperazino-phenyl)azepane MLS000676164 cid_2929455
Type:
Small organic molecule
Emp. Form.:
C16H23FN4O2
Mol. Mass.:
322.3778
SMILES:
[O-][N+](=O)c1cc(F)c(cc1N1CCNCC1)N1CCCCCC1
: