Target
Nuclear receptor subfamily 5 group A member 2
Ligand
BDBM95592
Substrate
IC50
167.85±n/a nM
Citation
 PubChem, PC Luminescence-based cell-based high throughput dose response assay for inverse agonists of the liver receptor homolog-1 (LRH-1; NR5A2) PubChem Bioassay (2013)[AID] 
Target
Name:
Nuclear receptor subfamily 5 group A member 2
Synonyms:
Alpha-1-fetoprotein transcription factor B1F CYP7A promoter-binding factor Hepatocytic transcription factor Liver Receptor Homolog 1 NR5A2_HUMAN hB1F | nuclear receptor subfamily 5 group A member 2 isoform 2
Type:
Nuclear Hormone Receptor
Mol. Mass.:
61341.37
Organism:
Homo sapiens (Human)
Description:
Residue:
541
  
Inhibitor
Name:
BDBM95592
Synonyms:
2-(2-keto-4,7-dimethyl-chromen-5-yl)oxy-N-thiazol-2-yl-acetamide 2-(4,7-dimethyl-2-oxochromen-5-yl)oxy-N-(1,3-thiazol-2-yl)acetamide MLS001160235 cid_8069390
Type:
Small organic molecule
Emp. Form.:
C16H14N2O4S
Mol. Mass.:
330.358
SMILES:
Cc1cc(OCC(=O)Nc2nccs2)c2c(C)cc(=O)oc2c1
: