Target
Nuclear receptor subfamily 5 group A member 2
Ligand
BDBM95601
Substrate
IC50
1312±n/a nM
Citation
 PubChem, PC Luminescence-based cell-based high throughput dose response assay for inverse agonists of the liver receptor homolog-1 (LRH-1; NR5A2) PubChem Bioassay (2013)[AID] 
Target
Name:
Nuclear receptor subfamily 5 group A member 2
Synonyms:
Alpha-1-fetoprotein transcription factor B1F CYP7A promoter-binding factor Hepatocytic transcription factor Liver Receptor Homolog 1 NR5A2_HUMAN hB1F | nuclear receptor subfamily 5 group A member 2 isoform 2
Type:
Nuclear Hormone Receptor
Mol. Mass.:
61341.37
Organism:
Homo sapiens (Human)
Description:
Residue:
541
  
Inhibitor
Name:
BDBM95601
Synonyms:
MLS001159103 N-cyclopropyl-2-(7-methyl-2-oxidanylidene-4-propyl-chromen-5-yl)oxy-ethanamide N-cyclopropyl-2-[(7-methyl-2-oxo-4-propyl-1-benzopyran-5-yl)oxy]acetamide cid_4905846
Type:
Small organic molecule
Emp. Form.:
C18H21NO4
Mol. Mass.:
315.3636
SMILES:
CCCc1cc(=O)oc2cc(C)cc(OCC(=O)NC3CC3)c12
: