Target
Nuclear receptor subfamily 5 group A member 2
Ligand
BDBM95653
Substrate
IC50
>3984±n/a nM
Citation
 PubChem, PC Luminescence-based cell-based high throughput dose response assay for inverse agonists of the liver receptor homolog-1 (LRH-1; NR5A2) PubChem Bioassay (2013)[AID] 
Target
Name:
Nuclear receptor subfamily 5 group A member 2
Synonyms:
Alpha-1-fetoprotein transcription factor B1F CYP7A promoter-binding factor Hepatocytic transcription factor Liver Receptor Homolog 1 NR5A2_HUMAN hB1F | nuclear receptor subfamily 5 group A member 2 isoform 2
Type:
Nuclear Hormone Receptor
Mol. Mass.:
61341.37
Organism:
Homo sapiens (Human)
Description:
Residue:
541
  
Inhibitor
Name:
BDBM95653
Synonyms:
1-oxido-3-pyridin-1-iumcarboxylic acid [2-(2-chloro-4-nitroanilino)-2-oxoethyl] ester MLS002170576 [2-(2-chloro-4-nitroanilino)-2-oxoethyl] 1-oxidopyridin-1-ium-3-carboxylate cid_3659548
Type:
Small organic molecule
Emp. Form.:
C14H10ClN3O6
Mol. Mass.:
351.699
SMILES:
[O-][N+](=O)c1ccc(NC(=O)COC(=O)c2ccc[n+]([O-])c2)c(Cl)c1
: