Target
Nuclear receptor subfamily 5 group A member 2
Ligand
BDBM95659
Substrate
IC50
1310±n/a nM
Citation
 PubChem, PC Luminescence-based cell-based high throughput dose response assay for inverse agonists of the liver receptor homolog-1 (LRH-1; NR5A2) PubChem Bioassay (2013)[AID] 
Target
Name:
Nuclear receptor subfamily 5 group A member 2
Synonyms:
Alpha-1-fetoprotein transcription factor B1F CYP7A promoter-binding factor Hepatocytic transcription factor Liver Receptor Homolog 1 NR5A2_HUMAN hB1F | nuclear receptor subfamily 5 group A member 2 isoform 2
Type:
Nuclear Hormone Receptor
Mol. Mass.:
61341.37
Organism:
Homo sapiens (Human)
Description:
Residue:
541
  
Inhibitor
Name:
BDBM95659
Synonyms:
2-(2,4-diketo-6-methyl-1,3-diazaspiro[4.5]decan-3-yl)-N-[2-(4-methoxyphenyl)ethyl]acetamide N-[2-(4-methoxyphenyl)ethyl]-2-(6-methyl-2,4-dioxo-1,3-diazaspiro[4.5]decan-3-yl)acetamide SMR001309260 | cid_3279586
Type:
Small organic molecule
Emp. Form.:
C20H27N3O4
Mol. Mass.:
373.4461
SMILES:
COc1ccc(CCNC(=O)CN2C(=O)NC3(CCCCC3C)C2=O)cc1
: