Target
Methionine--tRNA ligase
Ligand
BDBM90540
Substrate
IC50
784.35±n/a nM
Citation
 PubChem, PC Luminescence-based biochemical high throughput dose response assay for inhibitors of Trypanosoma brucei methionyl tRNA synthetase (MetRS) PubChem Bioassay (2013)[AID] 
Target
Name:
Methionine--tRNA ligase
Synonyms:
methionyl-tRNA synthetase
Type:
Enzyme Catalytic Domain
Mol. Mass.:
86905.45
Organism:
Trypanosoma brucei brucei strain 927/4 GUTat10.1
Description:
gi_71746704
Residue:
773
  
Inhibitor
Name:
BDBM90540
Synonyms:
(3Z)-N-(4-bromophenyl)-3-(4-nitrobenzyl)oximino-propionamide MLS000692001 SMR000333670 | cid_5933967
Type:
Small organic molecule
Emp. Form.:
C16H14BrN3O4
Mol. Mass.:
392.204
SMILES:
[O-][N+](=O)c1ccc(CO[N-][CH+]CC(=O)Nc2ccc(Br)cc2)cc1
: