Target
Methionine--tRNA ligase
Ligand
BDBM95819
Substrate
IC50
879.16±n/a nM
Citation
 PubChem, PC Luminescence-based biochemical high throughput dose response assay for inhibitors of Trypanosoma brucei methionyl tRNA synthetase (MetRS) PubChem Bioassay (2013)[AID] 
Target
Name:
Methionine--tRNA ligase
Synonyms:
methionyl-tRNA synthetase
Type:
Enzyme Catalytic Domain
Mol. Mass.:
86905.45
Organism:
Trypanosoma brucei brucei strain 927/4 GUTat10.1
Description:
gi_71746704
Residue:
773
  
Inhibitor
Name:
BDBM95819
Synonyms:
2-(8-Fluoro-5H-[1,2,4]triazino[5,6-b]indol-3-ylsulfanyl)-N-(4-methoxy-benzyl)-acetamide 2-[(8-fluoro-5H-[1,2,4]triazin[5,6-b]indol-3-yl)thio]-N-p-anisyl-acetamide 2-[(8-fluoro-5H-[1,2,4]triazino[5,6-b]indol-3-yl)thio]-N-[(4-methoxyphenyl)methyl]acetamide SMR000607036 | cid_24792386
Type:
Small organic molecule
Emp. Form.:
C19H16FN5O2S
Mol. Mass.:
397.426
SMILES:
COc1ccc(CNC(=O)CSc2nnc3c(n2)[nH]c2ccc(F)cc32)cc1
: