Target
Tegument protein VP16
Ligand
BDBM95471
Substrate
IC50
>35871±n/a nM
Citation
 PubChem, PC Counterscreen for inverse agonists of the liver receptor homolog-1 (LRH-1; NR5A2): Luminescence-based cell-based high throughput dose response assay to identify inhibitors of the Herpes Virus Virion Protein 16 (VP16) PubChem Bioassay (2013)[AID] 
Target
Name:
Tegument protein VP16
Synonyms:
Alpha trans-inducing protein (VP16) transactivating tegument protein VP16
Type:
PROTEIN
Mol. Mass.:
54325.13
Organism:
Human herpesvirus 1 (strain 17) (HHV-1) (Human herpes simplex virus1)
Description:
EBI_100271
Residue:
490
  
Inhibitor
Name:
BDBM95471
Synonyms:
3-(cyclopropanecarbonylamino)-N-(3-methoxyphenyl)-1-benzofuran-2-carboxamide 3-(cyclopropylcarbonylamino)-N-(3-methoxyphenyl)-1-benzofuran-2-carboxamide 3-[[cyclopropyl(oxo)methyl]amino]-N-(3-methoxyphenyl)-2-benzofurancarboxamide SMR000028620 | cid_3236057
Type:
Small organic molecule
Emp. Form.:
C20H18N2O4
Mol. Mass.:
350.3679
SMILES:
COc1cccc(NC(=O)c2oc3ccccc3c2NC(=O)C2CC2)c1
: