Target
Tegument protein VP16
Ligand
BDBM95486
Substrate
IC50
>35871±n/a nM
Citation
 PubChem, PC Counterscreen for inverse agonists of the liver receptor homolog-1 (LRH-1; NR5A2): Luminescence-based cell-based high throughput dose response assay to identify inhibitors of the Herpes Virus Virion Protein 16 (VP16) PubChem Bioassay (2013)[AID] 
Target
Name:
Tegument protein VP16
Synonyms:
Alpha trans-inducing protein (VP16) transactivating tegument protein VP16
Type:
PROTEIN
Mol. Mass.:
54325.13
Organism:
Human herpesvirus 1 (strain 17) (HHV-1) (Human herpes simplex virus1)
Description:
EBI_100271
Residue:
490
  
Inhibitor
Name:
BDBM95486
Synonyms:
5-methyl-3-phenyl-4-isoxazolecarboxylic acid [2-(4-methoxyanilino)-2-oxoethyl] ester MLS000565768 [2-(4-methoxyanilino)-2-oxoethyl] 5-methyl-3-phenyl-1,2-oxazole-4-carboxylate cid_5243996
Type:
Small organic molecule
Emp. Form.:
C20H18N2O5
Mol. Mass.:
366.3673
SMILES:
COc1ccc(NC(=O)COC(=O)c2c(C)onc2-c2ccccc2)cc1
: