Target
Tumor necrosis factor receptor superfamily member 10B
Ligand
BDBM63108
Substrate
EC50
>12500±n/a nM
Citation
 PubChem, PC Dose Response confirmation of uHTS hits for a small molecule Caspase-8 TRAIL sensitizers in a luminescence panel assay PubChem Bioassay (2013)[AID] 
Target
Name:
Tumor necrosis factor receptor superfamily member 10B
Synonyms:
DR5 TNFRSF10B TRAILR2 ZTNFR9 | tumor necrosis factor receptor superfamily member 10B isoform 1 precursor [Homo sapiens]
Type:
Enzyme Catalytic Domain
Mol. Mass.:
47869.76
Organism:
Homo sapiens (Human)
Description:
gi_224494019
Residue:
440
  
Inhibitor
Name:
BDBM63108
Synonyms:
(2-hydroxyphenyl)-[1-(4-methylphenyl)-4-pyrazolyl]methanone (2-hydroxyphenyl)-[1-(p-tolyl)pyrazol-4-yl]methanone MLS000549293 cid_1481829
Type:
Small organic molecule
Emp. Form.:
C17H14N2O2
Mol. Mass.:
278.3053
SMILES:
Cc1ccc(cc1)-n1cc(cn1)C(=O)c1ccccc1O
: