Target
Tumor necrosis factor receptor superfamily member 10B
Ligand
BDBM95909
Substrate
EC50
>12500±n/a nM
Citation
 PubChem, PC Dose Response confirmation of uHTS hits for a small molecule Caspase-8 TRAIL sensitizers in a luminescence panel assay PubChem Bioassay (2013)[AID] 
Target
Name:
Tumor necrosis factor receptor superfamily member 10B
Synonyms:
DR5 TNFRSF10B TRAILR2 ZTNFR9 | tumor necrosis factor receptor superfamily member 10B isoform 1 precursor [Homo sapiens]
Type:
Enzyme Catalytic Domain
Mol. Mass.:
47869.76
Organism:
Homo sapiens (Human)
Description:
gi_224494019
Residue:
440
  
Inhibitor
Name:
BDBM95909
Synonyms:
3-(1H-benzimidazol-2-yl)-6-methoxy-N-phenyl-1-benzopyran-2-imine 3-(1H-benzimidazol-2-yl)-6-methoxy-N-phenylchromen-2-imine SMR000235910 cid_3596734
Type:
Small organic molecule
Emp. Form.:
C23H17N3O2
Mol. Mass.:
367.4
SMILES:
COc1ccc2o\c(=N/c3ccccc3)c(cc2c1)-c1nc2ccccc2[nH]1
: