Target
Tumor necrosis factor receptor superfamily member 10B
Ligand
BDBM49349
Substrate
EC50
>12500±n/a nM
Citation
 PubChem, PC Dose Response confirmation of uHTS hits for a small molecule Caspase-8 TRAIL sensitizers in a luminescence panel assay PubChem Bioassay (2013)[AID] 
Target
Name:
Tumor necrosis factor receptor superfamily member 10B
Synonyms:
DR5 TNFRSF10B TRAILR2 ZTNFR9 | tumor necrosis factor receptor superfamily member 10B isoform 1 precursor [Homo sapiens]
Type:
Enzyme Catalytic Domain
Mol. Mass.:
47869.76
Organism:
Homo sapiens (Human)
Description:
gi_224494019
Residue:
440
  
Inhibitor
Name:
BDBM49349
Synonyms:
1-cyclohexyl-3-(2,3-dihydro-1,4-benzodioxin-6-yl)urea SMR000109844 | cid_844261
Type:
Small organic molecule
Emp. Form.:
C15H20N2O3
Mol. Mass.:
276.3309
SMILES:
O=C(NC1CCCCC1)Nc1ccc2OCCOc2c1
: