Target
Low molecular weight phosphotyrosine protein phosphatase
Ligand
BDBM95035
Substrate
IC50
13700±n/a nM
Citation
 PubChem, PC Dose response confirmation of small molecule inhibitors of Low Molecular Weight Protein Tyrosine Phosphatase, LMPTP, in an orthogonal absorbance-based assay PubChem Bioassay (2013)[AID] 
Target
Name:
Low molecular weight phosphotyrosine protein phosphatase
Synonyms:
3.1.3.2 ACP1 LMW-PTP LMWPTP PPAC_HUMAN low molecular weight phosphotyrosine protein phosphatase isoform c
Type:
Mol. Mass.:
18042.81
Organism:
Homo sapiens (Human)
Description:
P24666
Residue:
158
  
Inhibitor
Name:
BDBM95035
Synonyms:
2-(4-methylphenyl)-N-(3-pyridinylmethyl)-4-quinazolinamine MLS000550241 SMR000178038 cid_2790953
Type:
Small organic molecule
Emp. Form.:
C21H18N4
Mol. Mass.:
326.3944
SMILES:
Cc1ccc(cc1)-c1nc(NCc2cccnc2)c2ccccc2n1
: