Target
Tyrosine-protein phosphatase non-receptor type 22
Ligand
BDBM94956
Substrate
IC50
>80000±n/a nM
Citation
 PubChem, PC Dose response confirmation of small molecule inhibitors of Low Molecular Weight Protein Tyrosine Phosphatase, LMPTP, in a fluorescence-based, Lymphoid Phosphatase (PTPN22, LYP-1) selectivity Assay PubChem Bioassay (2013)[AID] 
Target
Name:
Tyrosine-protein phosphatase non-receptor type 22
Synonyms:
3.1.3.48 LyP Lymphoid phosphatase (Lyp) PEST-domain phosphatase PTPN22 Tyrosine-protein phosphatase non-receptor type 22 (LYP) | tyrosine-protein phosphatase non-receptor type 22 isoform 1
Type:
Mol. Mass.:
91712.31
Organism:
Homo sapiens (Human)
Description:
Q9Y2R2
Residue:
807
  
Inhibitor
Name:
BDBM94956
Synonyms:
3-[(2,6-dichlorophenyl)methyl]-N-(2-furanylmethyl)-6-purinamine 3-[[2,6-bis(chloranyl)phenyl]methyl]-N-(furan-2-ylmethyl)purin-6-amine SMR000036870 cid_665906
Type:
Small organic molecule
Emp. Form.:
C17H13Cl2N5O
Mol. Mass.:
374.224
SMILES:
Clc1cccc(Cl)c1Cn1cnc(NCc2ccco2)c2ncnc12
: