Target
Tyrosine-protein phosphatase non-receptor type 22
Ligand
BDBM94910
Substrate
IC50
>80000±n/a nM
Citation
 PubChem, PC Dose response confirmation of small molecule inhibitors of Low Molecular Weight Protein Tyrosine Phosphatase, LMPTP, in a fluorescence-based, Lymphoid Phosphatase (PTPN22, LYP-1) selectivity Assay PubChem Bioassay (2013)[AID] 
Target
Name:
Tyrosine-protein phosphatase non-receptor type 22
Synonyms:
3.1.3.48 LyP Lymphoid phosphatase (Lyp) PEST-domain phosphatase PTPN22 Tyrosine-protein phosphatase non-receptor type 22 (LYP) | tyrosine-protein phosphatase non-receptor type 22 isoform 1
Type:
Mol. Mass.:
91712.31
Organism:
Homo sapiens (Human)
Description:
Q9Y2R2
Residue:
807
  
Inhibitor
Name:
BDBM94910
Synonyms:
2-phenyl-4-(1-piperidinyl)quinoline 2-phenyl-4-piperidin-1-ylquinoline MLS000729043 cid_1504001
Type:
Small organic molecule
Emp. Form.:
C20H20N2
Mol. Mass.:
288.3862
SMILES:
C1CCN(CC1)c1cc(nc2ccccc12)-c1ccccc1
: