Target
Tyrosine-protein phosphatase non-receptor type 22
Ligand
BDBM69343
Substrate
IC50
>80000±n/a nM
Citation
 PubChem, PC Dose response confirmation of small molecule inhibitors of Low Molecular Weight Protein Tyrosine Phosphatase, LMPTP, in a fluorescence-based, Lymphoid Phosphatase (PTPN22, LYP-1) selectivity Assay PubChem Bioassay (2013)[AID] 
Target
Name:
Tyrosine-protein phosphatase non-receptor type 22
Synonyms:
3.1.3.48 LyP Lymphoid phosphatase (Lyp) PEST-domain phosphatase PTPN22 Tyrosine-protein phosphatase non-receptor type 22 (LYP) | tyrosine-protein phosphatase non-receptor type 22 isoform 1
Type:
Mol. Mass.:
91712.31
Organism:
Homo sapiens (Human)
Description:
Q9Y2R2
Residue:
807
  
Inhibitor
Name:
BDBM69343
Synonyms:
3-imidazol-1-ylpropyl-(2-phenylquinazolin-4-yl)amine N-(3-imidazol-1-ylpropyl)-2-phenyl-quinazolin-4-amine N-[3-(1-imidazolyl)propyl]-2-phenyl-4-quinazolinamine cid_4884906
Type:
Small organic molecule
Emp. Form.:
C20H19N5
Mol. Mass.:
329.3984
SMILES:
C(CNc1nc(nc2ccccc12)-c1ccccc1)Cn1ccnc1
: