Target
Tyrosine-protein phosphatase non-receptor type 22
Ligand
BDBM66141
Substrate
IC50
7640±n/a nM
Citation
 PubChem, PC Dose response confirmation of small molecule inhibitors of Low Molecular Weight Protein Tyrosine Phosphatase, LMPTP, in a fluorescence-based, Lymphoid Phosphatase (PTPN22, LYP-1) selectivity Assay PubChem Bioassay (2013)[AID] 
Target
Name:
Tyrosine-protein phosphatase non-receptor type 22
Synonyms:
3.1.3.48 LyP Lymphoid phosphatase (Lyp) PEST-domain phosphatase PTPN22 Tyrosine-protein phosphatase non-receptor type 22 (LYP) | tyrosine-protein phosphatase non-receptor type 22 isoform 1
Type:
Mol. Mass.:
91712.31
Organism:
Homo sapiens (Human)
Description:
Q9Y2R2
Residue:
807
  
Inhibitor
Name:
BDBM66141
Synonyms:
5-Nitro-furan-2-carboxylic acid [2-(2-fluoro-phenyl)-benzooxazol-5-yl]-amide N-[2-(2-fluorophenyl)-1,3-benzoxazol-5-yl]-5-nitro-2-furamide N-[2-(2-fluorophenyl)-1,3-benzoxazol-5-yl]-5-nitro-furan-2-carboxamide SMR000554884 | cid_3116398
Type:
Small organic molecule
Emp. Form.:
C18H10FN3O5
Mol. Mass.:
367.2875
SMILES:
[O-][N+](=O)c1ccc(o1)C(=O)Nc1ccc2oc(nc2c1)-c1ccccc1F
: