Target
Tyrosine-protein phosphatase non-receptor type 22
Ligand
BDBM94948
Substrate
IC50
50400±n/a nM
Citation
 PubChem, PC Dose response confirmation of small molecule inhibitors of Low Molecular Weight Protein Tyrosine Phosphatase, LMPTP, in a fluorescence-based, Lymphoid Phosphatase (PTPN22, LYP-1) selectivity Assay PubChem Bioassay (2013)[AID] 
Target
Name:
Tyrosine-protein phosphatase non-receptor type 22
Synonyms:
3.1.3.48 LyP Lymphoid phosphatase (Lyp) PEST-domain phosphatase PTPN22 Tyrosine-protein phosphatase non-receptor type 22 (LYP) | tyrosine-protein phosphatase non-receptor type 22 isoform 1
Type:
Mol. Mass.:
91712.31
Organism:
Homo sapiens (Human)
Description:
Q9Y2R2
Residue:
807
  
Inhibitor
Name:
BDBM94948
Synonyms:
MLS003123024 N-[4-[[[2-[(2-methoxyphenyl)methylamino]-4-thieno[3,2-d]pyrimidinyl]amino]methyl]phenyl]acetamide N-[4-[[[2-[(2-methoxyphenyl)methylamino]thieno[3,2-d]pyrimidin-4-yl]amino]methyl]phenyl]ethanamide cid_46948586
Type:
Small organic molecule
Emp. Form.:
C23H23N5O2S
Mol. Mass.:
433.526
SMILES:
COc1ccccc1CNc1nc(NCc2ccc(NC(C)=O)cc2)c2sccc2n1
: