Target
Botulinum neurotoxin type A
Ligand
BDBM44521
Substrate
EC50
600±n/a nM
Citation
 PubChem, PC Confirmatory FRET assay using full length substrates for Botulinum neurotoxin light chain A protease, with Powder Set01 PubChem Bioassay (2013)[AID] 
Target
Name:
Botulinum neurotoxin type A
Synonyms:
BXA1_CLOBH bna | botA
Type:
PROTEIN
Mol. Mass.:
149421.96
Organism:
Clostridium botulinum (strain Hall / ATCC 3502 / NCTC 13319 / Type A)
Description:
ChEMBL_987932
Residue:
1296
  
Inhibitor
Name:
BDBM44521
Synonyms:
2,3,6-triphenylimidazo[1,2-b][1,2,4]triazine SMR000184539 | cid_702952
Type:
Small organic molecule
Emp. Form.:
C23H16N4
Mol. Mass.:
348.3999
SMILES:
c1c(nc2nc(-c3ccccc3)c(nn12)-c1ccccc1)-c1ccccc1
: