Target
Botulinum neurotoxin type A
Ligand
BDBM31372
Substrate
EC50
3100±n/a nM
Citation
 PubChem, PC Confirmatory FRET assay using full length substrates for Botulinum neurotoxin light chain A protease, with Powder Set01 PubChem Bioassay (2013)[AID] 
Target
Name:
Botulinum neurotoxin type A
Synonyms:
BXA1_CLOBH bna | botA
Type:
PROTEIN
Mol. Mass.:
149421.96
Organism:
Clostridium botulinum (strain Hall / ATCC 3502 / NCTC 13319 / Type A)
Description:
ChEMBL_987932
Residue:
1296
  
Inhibitor
Name:
BDBM31372
Synonyms:
3-(2-furanyl)-5-(4-nitrophenyl)-2-phenyl-3,4-dihydropyrazole 5-(2-furyl)-3-(4-nitrophenyl)-1-phenyl-2-pyrazoline MLS000861141 cid_564008
Type:
Small organic molecule
Emp. Form.:
C19H15N3O3
Mol. Mass.:
333.3407
SMILES:
[O-][N+](=O)c1ccc(cc1)C1=NN(C(C1)c1ccco1)c1ccccc1
: