Target
Fructose-bisphosphate aldolase
Ligand
BDBM96098
Substrate
IC50
>9989±n/a nM
Citation
 PubChem, PC Fluorescence-based biochemical high throughput dose response assay for inhibitors of the fructose-bisphosphate aldolase (FBA) of M. tuberculosis PubChem Bioassay (2013)[AID] 
Target
Name:
Fructose-bisphosphate aldolase
Synonyms:
ALF_MYCTU FBPA Fructose-1,6-bisphosphate aldolase (FBA) Probable fructose-bisphosphate aldolase Fba | fba
Type:
Protein
Mol. Mass.:
36539.01
Organism:
Mycobacterium tuberculosis (strain H37Rv)
Description:
P9WQA3
Residue:
344
  
Inhibitor
Name:
BDBM96098
Synonyms:
3,4-Dihydro-1H-isoquinoline-2-carboxylic acid naphthalen-1-ylamide N-(1-naphthalenyl)-3,4-dihydro-1H-isoquinoline-2-carboxamide N-naphthalen-1-yl-3,4-dihydro-1H-isoquinoline-2-carboxamide cid_2901712
Type:
Small organic molecule
Emp. Form.:
C20H18N2O
Mol. Mass.:
302.3697
SMILES:
O=C(Nc1cccc2ccccc12)N1CCc2ccccc2C1
: