Target
Fructose-bisphosphate aldolase
Ligand
BDBM37759
Substrate
IC50
1555±n/a nM
Citation
 PubChem, PC Fluorescence-based biochemical high throughput dose response assay for inhibitors of the fructose-bisphosphate aldolase (FBA) of M. tuberculosis PubChem Bioassay (2013)[AID] 
Target
Name:
Fructose-bisphosphate aldolase
Synonyms:
ALF_MYCTU FBPA Fructose-1,6-bisphosphate aldolase (FBA) Probable fructose-bisphosphate aldolase Fba | fba
Type:
Protein
Mol. Mass.:
36539.01
Organism:
Mycobacterium tuberculosis (strain H37Rv)
Description:
P9WQA3
Residue:
344
  
Inhibitor
Name:
BDBM37759
Synonyms:
2-furancarboxylic acid [3-(2-methoxyphenyl)-2-methyl-4-oxo-1-benzopyran-7-yl] ester MLS000088249 [3-(2-methoxyphenyl)-2-methyl-4-oxidanylidene-chromen-7-yl] furan-2-carboxylate cid_1306464 | furan-2-carboxylic acid [4-keto-3-(2-methoxyphenyl)-2-methyl-chromen-7-yl] ester
Type:
Small organic molecule
Emp. Form.:
C22H16O6
Mol. Mass.:
376.3588
SMILES:
COc1ccccc1-c1c(C)oc2cc(OC(=O)c3ccco3)ccc2c1=O
: