Target
Fructose-bisphosphate aldolase
Ligand
BDBM96135
Substrate
IC50
2696±n/a nM
Citation
 PubChem, PC Fluorescence-based biochemical high throughput dose response assay for inhibitors of the fructose-bisphosphate aldolase (FBA) of M. tuberculosis PubChem Bioassay (2013)[AID] 
Target
Name:
Fructose-bisphosphate aldolase
Synonyms:
ALF_MYCTU FBPA Fructose-1,6-bisphosphate aldolase (FBA) Probable fructose-bisphosphate aldolase Fba | fba
Type:
Protein
Mol. Mass.:
36539.01
Organism:
Mycobacterium tuberculosis (strain H37Rv)
Description:
P9WQA3
Residue:
344
  
Inhibitor
Name:
BDBM96135
Synonyms:
Dibenzo[de,g]quinoline-6-carboxylic acid, 4,5-dihydro- 1,2,9,10-tetramethoxy-, ethyl ester SMR001566823 | cid_285758
Type:
Small organic molecule
Emp. Form.:
C23H25NO6
Mol. Mass.:
411.4477
SMILES:
CCOC(=O)N1CCc2cc(OC)c(OC)c3c4cc(OC)c(OC)cc4cc1c23
: