Target
Fructose-bisphosphate aldolase
Ligand
BDBM52034
Substrate
IC50
1647±n/a nM
Citation
 PubChem, PC Fluorescence-based biochemical high throughput dose response assay for inhibitors of the fructose-bisphosphate aldolase (FBA) of M. tuberculosis PubChem Bioassay (2013)[AID] 
Target
Name:
Fructose-bisphosphate aldolase
Synonyms:
ALF_MYCTU FBPA Fructose-1,6-bisphosphate aldolase (FBA) Probable fructose-bisphosphate aldolase Fba | fba
Type:
Protein
Mol. Mass.:
36539.01
Organism:
Mycobacterium tuberculosis (strain H37Rv)
Description:
P9WQA3
Residue:
344
  
Inhibitor
Name:
BDBM52034
Synonyms:
(2R)-1-[2-(4-ethyl-2-keto-8-methyl-chromen-7-yl)oxyacetyl]proline (2R)-1-[2-(4-ethyl-8-methyl-2-oxochromen-7-yl)oxyacetyl]pyrrolidine-2-carboxylic acid MLS001139413 cid_6569385
Type:
Small organic molecule
Emp. Form.:
C19H21NO6
Mol. Mass.:
359.3731
SMILES:
CCc1cc(=O)oc2c(C)c(OCC(=O)N3CCC[C@@H]3C(O)=O)ccc12
: