Target
Fructose-bisphosphate aldolase
Ligand
BDBM96197
Substrate
IC50
832.61±n/a nM
Citation
 PubChem, PC Fluorescence-based biochemical high throughput dose response assay for inhibitors of the fructose-bisphosphate aldolase (FBA) of M. tuberculosis PubChem Bioassay (2013)[AID] 
Target
Name:
Fructose-bisphosphate aldolase
Synonyms:
ALF_MYCTU FBPA Fructose-1,6-bisphosphate aldolase (FBA) Probable fructose-bisphosphate aldolase Fba | fba
Type:
Protein
Mol. Mass.:
36539.01
Organism:
Mycobacterium tuberculosis (strain H37Rv)
Description:
P9WQA3
Residue:
344
  
Inhibitor
Name:
BDBM96197
Synonyms:
4-[(2-chlorophenyl)methylsulfanyl]-6,7-dimethyl-pyrido[2,3-d]pyrimidin-2-amine 4-[(2-chlorophenyl)methylthio]-6,7-dimethyl-2-pyrido[2,3-d]pyrimidinamine SMR001557439 cid_243964
Type:
Small organic molecule
Emp. Form.:
C16H15ClN4S
Mol. Mass.:
330.835
SMILES:
Cc1cc2c(SCc3ccccc3Cl)nc(N)nc2nc1C
: