Target
Fructose-bisphosphate aldolase
Ligand
BDBM96198
Substrate
IC50
5815±n/a nM
Citation
 PubChem, PC Fluorescence-based biochemical high throughput dose response assay for inhibitors of the fructose-bisphosphate aldolase (FBA) of M. tuberculosis PubChem Bioassay (2013)[AID] 
Target
Name:
Fructose-bisphosphate aldolase
Synonyms:
ALF_MYCTU FBPA Fructose-1,6-bisphosphate aldolase (FBA) Probable fructose-bisphosphate aldolase Fba | fba
Type:
Protein
Mol. Mass.:
36539.01
Organism:
Mycobacterium tuberculosis (strain H37Rv)
Description:
P9WQA3
Residue:
344
  
Inhibitor
Name:
BDBM96198
Synonyms:
1-(2-methoxy-3-dibenzofuranyl)-3-(3-methylphenyl)thiourea 1-(2-methoxydibenzofuran-3-yl)-3-(m-tolyl)thiourea SMR000152407 | cid_4432181
Type:
Small organic molecule
Emp. Form.:
C21H18N2O2S
Mol. Mass.:
362.445
SMILES:
COc1cc2c(cc1NC(=S)Nc1cccc(C)c1)oc1ccccc21
: