Target
RecBCD enzyme subunit RecD
Ligand
BDBM94482
Substrate
IC50
85234±n/a nM
Citation
 PubChem, PC Absorbance-based bacterial cell-based high throughput dose response assay to identify inhibitors of RecBCD PubChem Bioassay (2013)[AID] 
Target
Name:
RecBCD enzyme subunit RecD
Synonyms:
RECD_ECOLI hopE | recD
Type:
Enzyme Catalytic Domain
Mol. Mass.:
66906.68
Organism:
Escherichia coli str. K-12 substr. MG1655
Description:
gi_16130723
Residue:
608
  
Inhibitor
Name:
BDBM94482
Synonyms:
4-(4,5-Dimethyl-oxazol-2-ylamino)-benzenesulfonamide 4-[(4,5-dimethyl-2-oxazolyl)amino]benzenesulfonamide MLS000029282 cid_648308
Type:
Small organic molecule
Emp. Form.:
C11H13N3O3S
Mol. Mass.:
267.304
SMILES:
Cc1nc(Nc2ccc(cc2)S(N)(=O)=O)oc1C
: