Target
RecBCD enzyme subunit RecD
Ligand
BDBM96265
Substrate
IC50
>118547±n/a nM
Citation
 PubChem, PC Absorbance-based bacterial cell-based high throughput dose response assay to identify inhibitors of RecBCD PubChem Bioassay (2013)[AID] 
Target
Name:
RecBCD enzyme subunit RecD
Synonyms:
RECD_ECOLI hopE | recD
Type:
Enzyme Catalytic Domain
Mol. Mass.:
66906.68
Organism:
Escherichia coli str. K-12 substr. MG1655
Description:
gi_16130723
Residue:
608
  
Inhibitor
Name:
BDBM96265
Synonyms:
1-(3-Chloro-phenyl)-3-(3-fluoro-phenyl)-urea MLS001209304 cid_266468
Type:
Small organic molecule
Emp. Form.:
C13H10ClFN2O
Mol. Mass.:
264.683
SMILES:
Fc1cccc(NC(=O)Nc2cccc(Cl)c2)c1
: