Target
RecBCD enzyme subunit RecD
Ligand
BDBM58394
Substrate
IC50
>118696±n/a nM
Citation
 PubChem, PC Absorbance-based bacterial cell-based high throughput dose response assay to identify inhibitors of RecBCD PubChem Bioassay (2013)[AID] 
Target
Name:
RecBCD enzyme subunit RecD
Synonyms:
RECD_ECOLI hopE | recD
Type:
Enzyme Catalytic Domain
Mol. Mass.:
66906.68
Organism:
Escherichia coli str. K-12 substr. MG1655
Description:
gi_16130723
Residue:
608
  
Inhibitor
Name:
BDBM58394
Synonyms:
10-hydroxy-5-oxido-2-phenazin-5-iumone 10-hydroxy-5-oxidophenazin-5-ium-2-one 5-oxidanidyl-10-oxidanyl-phenazin-5-ium-2-one SMR000513883 | cid_343973
Type:
Small organic molecule
Emp. Form.:
C12H8N2O3
Mol. Mass.:
228.2035
SMILES:
On1c2ccccc2[n+]([O-])c2ccc(=O)cc12
: