Target
RecBCD enzyme subunit RecD
Ligand
BDBM96274
Substrate
IC50
>118454±n/a nM
Citation
 PubChem, PC Absorbance-based bacterial cell-based high throughput dose response assay to identify inhibitors of RecBCD PubChem Bioassay (2013)[AID] 
Target
Name:
RecBCD enzyme subunit RecD
Synonyms:
RECD_ECOLI hopE | recD
Type:
Enzyme Catalytic Domain
Mol. Mass.:
66906.68
Organism:
Escherichia coli str. K-12 substr. MG1655
Description:
gi_16130723
Residue:
608
  
Inhibitor
Name:
BDBM96274
Synonyms:
5-Aza-2'-deoxycytidine MLS001332587 cid_451668
Type:
Small organic molecule
Emp. Form.:
C8H12N4O4
Mol. Mass.:
228.2053
SMILES:
Nc1ncn([C@H]2C[C@H](O)[C@@H](CO)O2)c(=O)n1
: