Target
RecBCD enzyme subunit RecD
Ligand
BDBM96275
Substrate
IC50
>118487±n/a nM
Citation
 PubChem, PC Absorbance-based bacterial cell-based high throughput dose response assay to identify inhibitors of RecBCD PubChem Bioassay (2013)[AID] 
Target
Name:
RecBCD enzyme subunit RecD
Synonyms:
RECD_ECOLI hopE | recD
Type:
Enzyme Catalytic Domain
Mol. Mass.:
66906.68
Organism:
Escherichia coli str. K-12 substr. MG1655
Description:
gi_16130723
Residue:
608
  
Inhibitor
Name:
BDBM96275
Synonyms:
1-methyl-4-(1-methyl-4-pyridin-1-iumyl)pyridin-1-ium;chloride Gramoxone Paraquat dichloride cid_5351279
Type:
Small organic molecule
Emp. Form.:
C12H14N2
Mol. Mass.:
186.2519
SMILES:
C[n+]1ccc(cc1)-c1cc[n+](C)cc1
: