Target
T cell receptor alpha variable 4
Ligand
BDBM50647
Substrate
IC50
4388±n/a nM
Citation
 PubChem, PC Fluorescence-based biochemical primary high throughput dose response assay to identify inhibitors of T-cell receptor (TCR)-CD3 interaction using a TAMRA-labeled TCR probe PubChem Bioassay (2013)[AID] 
Target
Name:
T cell receptor alpha variable 4
Synonyms:
TCRAV4S1 TVA4_HUMAN
Type:
Enzyme Catalytic Domain
Mol. Mass.:
12216.28
Organism:
Homo sapiens (Human)
Description:
A0A0B4J268
Residue:
109
  
Inhibitor
Name:
BDBM50647
Synonyms:
2,3,4,5-tetrahydroxy-6-benzo[7]annulenone 2,3,4,5-tetrahydroxybenzocyclohepten-6-one MLS000738105 cid_5281571
Type:
Small organic molecule
Emp. Form.:
C11H8O5
Mol. Mass.:
220.1782
SMILES:
Oc1cc2cccc(=O)c(O)c2c(O)c1O
: