Target
T cell receptor alpha variable 4
Ligand
BDBM52902
Substrate
IC50
>94028±n/a nM
Citation
 PubChem, PC Fluorescence-based biochemical primary high throughput dose response assay to identify inhibitors of T-cell receptor (TCR)-CD3 interaction using a TAMRA-labeled TCR probe PubChem Bioassay (2013)[AID] 
Target
Name:
T cell receptor alpha variable 4
Synonyms:
TCRAV4S1 TVA4_HUMAN
Type:
Enzyme Catalytic Domain
Mol. Mass.:
12216.28
Organism:
Homo sapiens (Human)
Description:
A0A0B4J268
Residue:
109
  
Inhibitor
Name:
BDBM52902
Synonyms:
2-Hydroxy-benzoic acid N'-[1-furan-2-ylmethyl-2,4,6-trioxo-tetrahydro-pyrimidin-(5E)-ylidenemethyl]-hydrazide N'-[(E)-[1-(2-furanylmethyl)-2,4,6-trioxo-1,3-diazinan-5-ylidene]methyl]-2-hydroxybenzohydrazide N'-[(E)-[1-(furan-2-ylmethyl)-2,4,6-trioxo-1,3-diazinan-5-ylidene]methyl]-2-hydroxybenzohydrazide SMR000414423 | cid_5515627
Type:
Small organic molecule
Emp. Form.:
C17H14N4O6
Mol. Mass.:
370.3163
SMILES:
Oc1ccccc1C(=O)NNC=C1C(=O)NC(=O)N(Cc2ccco2)C1=O
: